博客
关于我
opencv_core.dir/objects.a(vs_version.rc.obj)‘ is incompatible with i386:x86-64 output
阅读量:806 次
发布时间:2023-02-23

本文共 756 字,大约阅读时间需要 2 分钟。

在编译OpenCV时,可能会遇到如下的错误信息:

i386 architecture of input file 'CMakeFiles\opencv_core.dir\objects.a(vs_version.rc.obj)' is incompatible with i386:x86-64 outputcollect2.exe: error: ld returned 1 exit statusmingw32-make[2]: *** [modules\core\CMakeFiles\opencv_core.dir\build.make:1630: bin/libopencv_core453d.dll] Error 1mingw32-make[1]: *** [CMakeFiles\Makefile2:1749: modules/core/CMakeFiles/opencv_core.dir/all] Error 2mingw32-make: *** [Makefile:165: all] Error 2

这个错误通常与编译器的版本不兼容有关。这个问题在OpenCV 3.3.0版本中被报告过,可能是由于CMake配置的问题。

解决方法是通过CMake参数进行配置,具体步骤如下:

  • 在CMake界面中,找到"add Entry"按钮,点击它选择新建一个布尔选项,名称为OPENCV_VS_VERSIONINFO_SKIP,然后点击“钩选”将其勾选。
  • 这样做可以跳过对Visual Studio版本信息的检查,从而避免上述编译错误。

    需要注意的是,以上方法仅适用于Visual Studio项目。如果使用其他开发环境或不需要Visual Studio支持的功能,建议按照上述步骤进行CMake配置。

    转载地址:http://zqsfk.baihongyu.com/

    你可能感兴趣的文章
    Python日期时间模块
    查看>>
    Python函数合集:足足68个内置函数请收好!
    查看>>
    Python+Selenium自动化测试项目实战
    查看>>
    Python+Selenium自动化测试项目实战【建议收藏】
    查看>>
    Python+Selenium自动化测试:Page Object模式
    查看>>
    python+selenium进行cnblog的自动化登录测试
    查看>>
    Python函数只返回第一个值而不是数据框
    查看>>
    Python+SQL实战:京东用户行为数据分析案例解析(上)
    查看>>
    Python+SQL实战:京东用户行为数据分析案例解析(下)
    查看>>
    PYTHON+Twisted+sqlanydb=ABORT()
    查看>>
    Python函数之返回值、作用域和局部变量
    查看>>
    Python+统计学 | 探索常用的数据分析统计分布
    查看>>
    python, selenium中用于切换帧的函数
    查看>>
    python函数
    查看>>
    python----线程、进程、协程的区别及多线程详解
    查看>>
    python---5
    查看>>
    python---使用celery分布式系统异步发送短信(云通讯)来验证登录
    查看>>
    python--003--百分号字符串拼接、format
    查看>>
    Python--10、线程
    查看>>
    Python--Redis实战:第四章:数据安全与性能保障:第4节:复制
    查看>>